Org.apache.spark.sparkexception job aborted due to stage failure

Jun 25, 2020 · Apache Spark; koukou. ... org.apache.spa

Mar 24, 2018 · Here is the full list of commands creating the list, writing it to HDFS and finally printing out the results on the console using hdfs: spark-shell. After the shell has started you type: val nums = sc.parallelize (List (1,2,3,4,5)) nums.saveAsTextFile ("/tmp/simple_list") :quit. Now we read the data from HDFS (Hadoop File System): org.apache.spark.SparkException: Job aborted due to stage failure: 8 Databricks Exception: Total size of serialized results is bigger than spark.driver.maxResultsSizeFor Spark jobs submitted with --deploy-mode cluster, run the following command on the master node to find stage failures in the YARN application logs. Replace application_id with the ID of your Spark application (for example, application_1572839353552_0008 ). yarn logs -applicationId application_id | grep "Job aborted due to stage failure" -A 10.

Did you know?

Based on the code , am not seeing anything wrong . Still you can analysis this issue based on the following data related . Make sure 4th line lines rdd has the data based on the collect().Use the DF transformations to create the statistics you need, THEN call collect/show to get the result back to the driver. That way you are only downloading the stats, not the full data.Jun 25, 2020 · Apache Spark; koukou. ... org.apache.spark.SparkException: Job aborted due to stage failure: Task 0 in stage 30.0 failed 1 times, most recent failure: Lost task 0.0 ... Apr 9, 2021 · Viewed 8k times. 1. I am trying to do some computation using UDFs. But after the computation when i try to convert the pyspark dataframe to pandas it gives me org.apache.spark.SparkException: Exception thrown in awaitResult: I will put down the reproducible code. import pandas as pd import numpy as np import time n = 10000 sample_df = pd ... Pyspark. spark.SparkException: Job aborted due to stage failure: Task 0 in stage 15.0 failed 1 times, java.net.SocketException: Connection reset Hot Network Questions Does America, like non-democratic countries like China, also have factions?Solution 1. Check your environment variables. You are getting “py4j.protocol.Py4JError: org.apache.spark.api.python.PythonUtils.getEncryptionEnabled does not exist in the JVM” due to Spark environemnt variables are not set right.SparkException: Python worker failed to connect back when execute spark action 4 Pyspark. spark.SparkException: Job aborted due to stage failure: Task 0 in stage 15.0 failed 1 times, java.net.SocketException: Connection resetApache Spark; koukou. ... org.apache.spark.SparkException: Job aborted due to stage failure: Task 0 in stage 30.0 failed 1 times, most recent failure: Lost task 0.0 ...Jul 7, 2019 · 1 I'm trying to use Linear Regression on a simple dataframe with one feature and one label using Python pyspark in Databricks. However, I'm running into some issues with stage failure. I've reviewed many similar problems, but most of them are in Scala or are out of the scope of what I'm doing here. Versions: Oct 30, 2018 · You need to change this parameter in the cluster configuration. Go into the cluster settings, under Advanced select spark and paste spark.driver.maxResultSize 0 (for unlimited) or whatever the value suits you. Using 0 is not recommended. You should optimize the job by re partitioning. I am running spark jobs using datafactory in azure databricks. My cluster vesion is 9.1 LTS ML (includes Apache Spark 3.1.2, Scala 2.12). I am writing data on azure blob storage. While writing job ...Oct 30, 2018 · You need to change this parameter in the cluster configuration. Go into the cluster settings, under Advanced select spark and paste spark.driver.maxResultSize 0 (for unlimited) or whatever the value suits you. Using 0 is not recommended. You should optimize the job by re partitioning. Jul 17, 2020 · Caused by: org.apache.spark.SparkException: Job aborted due to stage failure: Serialized task 2:0 was 155731289 bytes, which exceeds max allowed: spark.rpc.message.maxSize (134217728 bytes). Consider increasing spark.rpc.message.maxSize or using broadcast variables for large values. Mar 29, 2020 · Check Apache Spark installation on Windows 10 steps. Use different versions of Apache Spark (tried 2.4.3 / 2.4.2 / 2.3.4). Disable firewall windows and antivirus that I have installed. Tried to initialize the SparkContext manually with sc = spark.sparkContext (found this possible solution at this question here in Stackoverflow, didn´t work for ... Sep 1, 2022 · use dbr version : 10.4 LTS (includes Apache Spark 3.2.1, Scala 2.12) for spark configuartion edit the spark tab by editing the cluster and use below code there. "spark.sql.ansi.enabled false" When I run the demo : from pyspark.ml.linalg import Vectors import tempfile conf = SparkConf().setAppName('ansonzhou_test').setAll([ ('spark.executor.memory', '8g ...Data collection is indirect, with data being stored both on the JVM side and Python side. While JVM memory can be released once data goes through socket, peak memory usage should account for both. Plain toPandas implementation collects Rows first, then creates Pandas DataFrame locally. This further increases (possibly doubles) memory usage.

Apr 9, 2021 · Viewed 8k times. 1. I am trying to do some computation using UDFs. But after the computation when i try to convert the pyspark dataframe to pandas it gives me org.apache.spark.SparkException: Exception thrown in awaitResult: I will put down the reproducible code. import pandas as pd import numpy as np import time n = 10000 sample_df = pd ... SparkException: Python worker failed to connect back when execute spark action 4 Pyspark. spark.SparkException: Job aborted due to stage failure: Task 0 in stage 15.0 failed 1 times, java.net.SocketException: Connection resetWhen I run the demo : from pyspark.ml.linalg import Vectors import tempfile conf = SparkConf().setAppName('ansonzhou_test').setAll([ ('spark.executor.memory', '8g ...Nov 12, 2018 · Pyspark. spark.SparkException: Job aborted due to stage failure: Task 0 in stage 15.0 failed 1 times, java.net.SocketException: Connection reset Hot Network Questions Does America, like non-democratic countries like China, also have factions?

Go into the cluster settings, under Advanced select spark and paste spark.driver.maxResultSize 0 (for unlimited) or whatever the value suits you. Using 0 is not recommended. You should optimize the job by re partitioning. For more details, refer "Spark Configurations - Application Properties". Hope this helps. Do let us know if you any further ...org.apache.spark.SparkException: Job aborted due to stage failure: Task 29 in stage 0.0 failed 4 times, most recent failure: Lost task 29.3 in stage 0.0 (TID 92, 10.252.252.125, executor 23): ExecutorLostFailure (executor 23 exited caused by one of the running tasks) Reason: Remote RPC client disassociated.…

Reader Q&A - also see RECOMMENDED ARTICLES & FAQs. Apache Spark; koukou. ... org.apache.spark.SparkException: Job aborted. Possible cause: I installed apache-spark and pyspark on my machine (Ubuntu), and in Pycharm, I also u.

Nov 2, 2020 · Teams. Q&A for work. Connect and share knowledge within a single location that is structured and easy to search. Learn more about Teams Caused by: org.apache.spark.SparkException: Job aborted due to stage failure: Total size of serialized results of 478 tasks (2026.0 MB) is bigger than spark.driver.maxResultSize (1024.0 MB) 当然可以通过调大spark.driver.maxResultSize的默认配置来解决问题,但如果不能从源头上解决小文件问题,以后还可能遇到 ...

Caused by: org.apache.spark.SparkException: Job aborted due to stage failure: Task 6 in stage 16.0 failed 4 times, most recent failure: Lost task 6.3 in stage 16.0 (TID 478, idc-sql-dms-13, executor 40): ExecutorLostFailure (executor 40 exited caused by one of the running tasks) Reason: Container killed by YARN for exceeding memory limits. 11.8 ... >>Job aborted due to stage failure: Total size of serialized results of 19 tasks (4.2 GB) is bigger than spark.driver.maxResultSize (4.0 GB)'.. The exception was raised by the IDbCommand interface. Please take a look at following document about maxResultsize issue:

不知道是什么原因。. (利用 Spark-submit 提交 参数都正常). 但是 集群上的版本是1.5,和2.0都无法跑 Aug 12, 2021 · SparkException:执行 spark 操作时 Python 工作线程无法连接回spark.SparkException: Python worker failed to connect back.问问题当我尝试在 pyspark 执行此命令行时from pyspark import SparkConf, SparkContext# 创建SparkConf和SparkContextconf = SparkConf().setMaster("local").setAppName("lic 1 Answer. PySpark DF are lazy loading. When you call .show () you aWhen a stage failure occurs, the Spark driver logs report an ex Aug 26, 2018 · Exception logs: 2018-08-26 16:15:02 INFO DAGScheduler:54 - ResultStage 0 (parquet at ReadDb2HDFS.scala:288) failed in 1008.933 s due to Job aborted due to stage failure: Task 0 in stage 0.0 failed 4 times, most recent failure: Lost task 0.3 in stage 0.0 (TID 3, master, executor 4): ExecutorLostFailure (executor 4 exited caused by one of the ... Dec 6, 2018 · 1. "Accept timed out" generally points to a problem with your spark instance. It may be overloaded or not enough resources (memory/cpu) to start your job or it might be a temporary network issue. You can monitor you jobs on Spark UI. Also there is some issue with your code. Check Apache Spark installation on Windows 10 steps. Use di 1 Answer. Sorted by: 1. You need to create an RDD of type RDD [Tuple [str]] but in your code, the line: rdd = spark.sparkContext.parallelize (comments) returns RDD [str] which then fails when you try to convert it to dataframe with that given schema. Try modifying that line to:I'm new to spark, and was trying to run the example JavaSparkPi.java, it runs well, but because i have to use this in another java s I copy all things from main to a method in the class and try to call the method in main, it saids . org.apache.spark.SparkException: Job aborted: Task not serializable: java.io.NotSerializableException I am trying to run a pyspark job but it is failinSolve : org.apache.spark.SparkException: Job abo: org.apache.spark.SparkException: Job aborted due to stage failure Caused by: org.apache.spark.SparkException: Job aborted due to stage failure: Aborting TaskSet 0.0 because task 0 (partition 0) cannot run anywhere due to node and executor blacklist. Jan 4, 2019 · Exception in thread "main&quo Caused by: org.apache.spark.SparkException: Job aborted due to stage failure: Aborting TaskSet 0.0 because task 0 (partition 0) cannot run anywhere due to node and executor blacklist.I am trying to solve the problems from O'Reilly book of Learning Spark. Below part of code is working fine from pyspark.sql.types import * from pyspark.sql import SparkSession from pyspark.sql.func... Apr 19, 2015 · org.apache.spark.SparkException: Job aborted due[Thanks for contributing an answer to Stack OHere is the full list of commands creating org.apache.spark.SparkException: Job aborted due to stage failure: Task in stage failed,Lost task in stage : ExecutorLostFailure (executor 4 lost) 12 org.apache.spark.SparkException: Job aborted due to stage failure: Task 98 in stage 11.0 failed 4 times